Target
Histone deacetylase 3
Ligand
BDBM50442737
Substrate
Meas. Tech.
ChEMBL_989767 (CHEMBL2446005)
IC50
53±n/a nM
Citation
 Zhang, XBao, BYu, XTong, LLuo, YHuang, QSu, MSheng, LLi, JZhu, HYang, BZhang, XChen, YLu, W The discovery and optimization of novel dual inhibitors of topoisomerase II and histone deacetylase. Bioorg Med Chem 21:6981-95 (2013)  
Target
Name:
Histone deacetylase 3
Synonyms:
HD3 HDAC3_HUMAN Human HDAC3 SMAP45
Type:
Enzyme
Mol. Mass.:
48829.55
Organism:
Homo sapiens (Human)
Description:
O15379
Residue:
428
  
Inhibitor
Name:
BDBM50442737
Synonyms:
CHEMBL2442691
Type:
Small organic molecule
Emp. Form.:
C35H40N2O10
Mol. Mass.:
648.6995
SMILES:
COc1cc(cc(OC)c1O)[C@H]1[C@@H]2[C@H](COC2=O)[C@H](Nc2ccc(OCCCCCCCC(=O)NO)cc2)c2cc3OCOc3cc12
: