Target
Dual specificity protein kinase TTK
Ligand
BDBM50442757
Substrate
Meas. Tech.
ChEMBL_989465 (CHEMBL2443992)
IC50
>10.0±n/a nM
Citation
 Brasca, MGMantegani, SAmboldi, NBindi, SCaronni, DCasale, ECeccarelli, WColombo, NDe Ponti, ADonati, DErmoli, AFachin, GFelder, ERFerguson, RDFiorelli, CGuanci, MIsacchi, APesenti, EPolucci, PRiceputi, LSola, FVisco, CZuccotto, FFogliatto, G Discovery of NMS-E973 as novel, selective and potent inhibitor of heat shock protein 90 (Hsp90). Bioorg Med Chem 21:7047-63 (2013)  
Target
Name:
Dual specificity protein kinase TTK
Synonyms:
Dual specificity protein kinase (TTK) MPS1 Monopolar Spindle 1 (MPS1) Monopolar Spindle 1 Kinase (MPS1) TTK | TTK_HUMAN
Type:
Protein
Mol. Mass.:
97086.79
Organism:
Homo sapiens (Human)
Description:
P33981
Residue:
857
  
Inhibitor
Name:
BDBM50442757
Synonyms:
CHEMBL2443026
Type:
Small organic molecule
Emp. Form.:
C31H38N4O7
Mol. Mass.:
578.656
SMILES:
CN(C)c1ccc(Oc2cc(O)cc(O)c2-c2cc(no2)C(=O)NC2CCN(CC2)C2CCC3(CC2)OCCO3)cc1
: