Target
Tyrosine-protein kinase JAK3
Ligand
BDBM50442759
Substrate
Meas. Tech.
ChEMBL_989471 (CHEMBL2443998)
IC50
>10.0±n/a nM
Citation
 Brasca, MGMantegani, SAmboldi, NBindi, SCaronni, DCasale, ECeccarelli, WColombo, NDe Ponti, ADonati, DErmoli, AFachin, GFelder, ERFerguson, RDFiorelli, CGuanci, MIsacchi, APesenti, EPolucci, PRiceputi, LSola, FVisco, CZuccotto, FFogliatto, G Discovery of NMS-E973 as novel, selective and potent inhibitor of heat shock protein 90 (Hsp90). Bioorg Med Chem 21:7047-63 (2013)  
Target
Name:
Tyrosine-protein kinase JAK3
Synonyms:
JAK-3 JAK3_HUMAN Janus kinase 3 (JAK3) L-JAK | Leukocyte janus kinase
Type:
Protein
Mol. Mass.:
125111.08
Organism:
Homo sapiens (Human)
Description:
P52333
Residue:
1124
  
Inhibitor
Name:
BDBM50442759
Synonyms:
CHEMBL2443138
Type:
Small organic molecule
Emp. Form.:
C24H28N4O5
Mol. Mass.:
452.5029
SMILES:
CN(C)c1ccc(Oc2cc(O)cc(O)c2-c2cc(no2)C(=O)NC2CCN(C)CC2)cc1
: