Target
Neuronal acetylcholine receptor subunit alpha-7
Ligand
BDBM82546
Substrate
Meas. Tech.
ChEMBL_990373 (CHEMBL2445786)
Ki
44000±n/a nM
Citation
 Bolchi, CValoti, EBinda, MFasoli, FFerrara, RFumagalli, LGotti, CMatucci, RVistoli, GPallavicini, M Design, synthesis and binding affinity of acetylcholine carbamoyl analogues. Bioorg Med Chem Lett 23:6481-5 (2013)  
Target
Name:
Neuronal acetylcholine receptor subunit alpha-7
Synonyms:
ACHA7_HUMAN Cholinergic, Nicotinic Alpha7 Neuronal acetylcholine receptor protein alpha-7 subunit Nicotinic acetylcholine receptor alpha-7 (alpha7 nAChR)
Type:
Mol. Mass.:
56448.33
Organism:
Homo sapiens (Human)
Description:
CHRNA7 (NACHRA7)
Residue:
502
  
Inhibitor
Name:
BDBM82546
Synonyms:
CAS_14721-69-8 N-methylcarbamylcholine | NMCC
Type:
Small organic molecule
Emp. Form.:
C7H17N2O2
Mol. Mass.:
161.2215
SMILES:
CNC(=O)OCC[N+](C)(C)C
: