Target
Plasminogen
Ligand
BDBM12311
Substrate
Meas. Tech.
ChEMBL_990377 (CHEMBL2446013)
IC50
>100000±n/a nM
Citation
 Bondada, LRondla, RPradere, ULiu, PLi, CBobeck, DMcBrayer, TTharnish, PCourcambeck, JHalfon, PWhitaker, TAmblard, FCoats, SJSchinazi, RF Azetidines and spiro azetidines as novel P2 units in hepatitis C virus NS3 protease inhibitors. Bioorg Med Chem Lett 23:6325-30 (2013)  
Target
Name:
Plasminogen
Synonyms:
Activation peptide PLG Plasmin Plasmin heavy chain A, short form | Plasmin light chain B
Type:
Enzyme
Mol. Mass.:
90579.18
Organism:
Homo sapiens (Human)
Description:
Residue:
810
  
Inhibitor
Name:
BDBM12311
Synonyms:
(1R,5S)-N-[3-Amino-1-(cyclobutylmethyl)-2,3-dioxopropyl]-3-[2(S)-[[[(1,1-dimethylethyl)amino]carbonyl]amino]-3,3-dimethyl-1-oxobutyl]-6,6-dimethyl-3-azabicyclo[3.1.0]hexan-2(S)-carboxamide BOCEPREVIR acs.jmedchem.1c00409_ST.355
Type:
Small organic molecule
Emp. Form.:
C27H45N5O5
Mol. Mass.:
519.6767
SMILES:
CC(C)(C)NC(=O)N[C@H](C(=O)N1C[C@H]2[C@@H]([C@H]1C(=O)NC(CC1CCC1)C(=O)C(N)=O)C2(C)C)C(C)(C)C
: