Target
Solute carrier organic anion transporter family member 1B3
Ligand
BDBM50318907
Substrate
Meas. Tech.
ChEMBL_1265866 (CHEMBL3039492)
IC50
2455±n/a nM
Citation
 De Bruyn, Tvan Westen, GJIjzerman, APStieger, Bde Witte, PAugustijns, PFAnnaert, PP Structure-based identification of OATP1B1/3 inhibitors. Mol Pharmacol 83:1257-67 (2013)  
Target
Name:
Solute carrier organic anion transporter family member 1B3
Synonyms:
LST2 OATP8 SLC21A8 SO1B3_HUMAN Solute carrier organic anion transporter family member 1B3 (OATP1B3)
Type:
Protein
Mol. Mass.:
77425.75
Organism:
Homo sapiens (Human)
Description:
Q9NPD5
Residue:
702
  
Inhibitor
Name:
BDBM50318907
Synonyms:
2-Ethoxy-3-[2'-(1H-tetrazol-5-yl)-biphenyl-4-ylmethyl]-3H-benzoimidazole-4-carboxylic acid 1-cyclohexyloxycarbonyloxy-ethyl ester Amias Blopress CHEMBL1014 Kenzen TCV-116 | candesartancilexetil
Type:
Small organic molecule
Emp. Form.:
C33H34N6O6
Mol. Mass.:
610.6597
SMILES:
CCOc1nc2cccc(C(=O)OC(C)OC(=O)OC3CCCCC3)c2n1Cc1ccc(cc1)-c1ccccc1-c1nnn[nH]1
: