Target
Solute carrier organic anion transporter family member 1B1
Ligand
BDBM50427512
Substrate
Meas. Tech.
ChEMBL_1265863 (CHEMBL3039489)
IC50
2630±n/a nM
Citation
 De Bruyn, Tvan Westen, GJIjzerman, APStieger, Bde Witte, PAugustijns, PFAnnaert, PP Structure-based identification of OATP1B1/3 inhibitors. Mol Pharmacol 83:1257-67 (2013)  
Target
Name:
Solute carrier organic anion transporter family member 1B1
Synonyms:
LST1 OATP2 SLC21A6 SO1B1_HUMAN Solute carrier organic anion transporter family member 1B1 (OATP1B1) | Thromboxane B2
Type:
Protein
Mol. Mass.:
76468.06
Organism:
Homo sapiens (Human)
Description:
Q9Y6L6
Residue:
691
  
Inhibitor
Name:
BDBM50427512
Synonyms:
AURIN Corallin Rosolic acid (18)
Type:
Small organic molecule
Emp. Form.:
C19H14O3
Mol. Mass.:
290.3127
SMILES:
[#8]-c1ccc(cc1)-[#6](=[#6]-1\[#6]=[#6]-[#6](=O)-[#6]=[#6]-1)\c1ccc(-[#8])cc1
: