Target
Solute carrier organic anion transporter family member 1B3
Ligand
BDBM50442899
Substrate
Meas. Tech.
ChEMBL_1265867 (CHEMBL3039493)
Ki
2020±n/a nM
Citation
 De Bruyn, Tvan Westen, GJIjzerman, APStieger, Bde Witte, PAugustijns, PFAnnaert, PP Structure-based identification of OATP1B1/3 inhibitors. Mol Pharmacol 83:1257-67 (2013)  
Target
Name:
Solute carrier organic anion transporter family member 1B3
Synonyms:
LST2 OATP8 SLC21A8 SO1B3_HUMAN Solute carrier organic anion transporter family member 1B3 (OATP1B3)
Type:
Protein
Mol. Mass.:
77425.75
Organism:
Homo sapiens (Human)
Description:
Q9NPD5
Residue:
702
  
Inhibitor
Name:
BDBM50442899
Synonyms:
CHEMBL1491099
Type:
Small organic molecule
Emp. Form.:
C18H14Cl2O7
Mol. Mass.:
413.206
SMILES:
COC(=O)c1c(C)c2Oc3c(Cl)c(O)c(Cl)c(C)c3C(=O)Oc2cc1OC
: