Target
Solute carrier organic anion transporter family member 1B3
Ligand
BDBM50442886
Substrate
Meas. Tech.
ChEMBL_1265867 (CHEMBL3039493)
Ki
1100±n/a nM
Citation
 De Bruyn, Tvan Westen, GJIjzerman, APStieger, Bde Witte, PAugustijns, PFAnnaert, PP Structure-based identification of OATP1B1/3 inhibitors. Mol Pharmacol 83:1257-67 (2013)  
Target
Name:
Solute carrier organic anion transporter family member 1B3
Synonyms:
LST2 OATP8 SLC21A8 SO1B3_HUMAN Solute carrier organic anion transporter family member 1B3 (OATP1B3)
Type:
Protein
Mol. Mass.:
77425.75
Organism:
Homo sapiens (Human)
Description:
Q9NPD5
Residue:
702
  
Inhibitor
Name:
BDBM50442886
Synonyms:
CHEMBL3137741
Type:
Small organic molecule
Emp. Form.:
C38H48O8
Mol. Mass.:
632.7829
SMILES:
[H][C@@]12[#6][C@@]3([H])[#6]-[#6]4-[#6](=O)-c5c(-[#8])c6-[#6]=[#6][C@@]([#6])([#6]-[#6]\[#6]=[#6](\[#6])-[#6])[#8]-c6c(-[#6]\[#6]=[#6](\[#6])-[#6])c5-[#8][C@@]14[C@@]([#6]\[#6]=[#6](\[#6])-[#6](-[#8])=O)([#8]C2([#6])[#6])[#6]3-[#8]
: