Target
Dipeptidyl peptidase 4
Ligand
BDBM50005111
Substrate
Meas. Tech.
ChEMBL_1275793 (CHEMBL3091126)
Ki
4500±n/a nM
Citation
 Heard, KRWu, WLi, YZhao, PWoznica, ILai, JHBeinborn, MSanford, DGDimare, MTChiluwal, AKPeters, DEWhicher, DSudmeier, JLBachovchin, WW A general method for making peptide therapeutics resistant to serine protease degradation: application to dipeptidyl peptidase IV substrates. J Med Chem 56:8339-51 (2013)  
Target
Name:
Dipeptidyl peptidase 4
Synonyms:
ADABP Adenosine deaminase complexing protein 2 CD_antigen=CD26 DPP4 DPPIV Dipeptidyl peptidase 4 (DPP IV) Dipeptidyl peptidase 4 (DPP4) Dipeptidyl peptidase 4 membrane form Dipeptidyl peptidase IV Dipeptidyl peptidase IV (DDP-IV) Dipeptidyl peptidase IV membrane form Dipeptidyl peptidase-IV (DPP-4) T-cell activation antigen CD26 | TP103
Type:
Enzyme
Mol. Mass.:
88271.01
Organism:
Homo sapiens (Human)
Description:
P27487
Residue:
766
  
Inhibitor
Name:
BDBM50005111
Synonyms:
CHEMBL3086656
Type:
Small organic molecule
Emp. Form.:
C27H49N9O5
Mol. Mass.:
579.7353
SMILES:
CC(C)[C@H](N)C(=O)N1CCC[C@H]1C(=O)NC(C(=O)N1CCC[C@H]1C(=O)N[C@@H](CCCNC(N)=N)C(N)=O)C(C)(C)C
: