Target
Neuronal acetylcholine receptor subunit alpha-4/beta-2
Ligand
BDBM50442930
Substrate
Meas. Tech.
ChEMBL_1276109 (CHEMBL3089190)
EC50
10.0±n/a nM
Citation
 Yenugonda, VMXiao, YLevin, EDRezvani, AHTran, TAl-Muhtasib, NSahibzada, NXie, TWells, CSlade, SJohnson, JEDakshanamurthy, SKong, HSTomita, YLiu, YPaige, MKellar, KJBrown, ML Design, synthesis and discovery of picomolar selective α4β2 nicotinic acetylcholine receptor ligands. J Med Chem 56:8404-21 (2013)  
Target
Name:
Neuronal acetylcholine receptor subunit alpha-4/beta-2
Synonyms:
Neuronal acetylcholine receptor Alpha-4/Beta-2 Neuronal acetylcholine receptor; alpha4/beta2 | nAChR subtypes alpha4 beta2
Type:
Protein
Mol. Mass.:
Description:
Components:
This complex has 2 components.
Component 1
Name:
Neuronal acetylcholine receptor subunit alpha-4
Synonyms:
ACHA4_HUMAN CHRNA4 protein Neuronal acetylcholine receptor protein alpha-4 subunit Nicotinic acetylcholine receptor alpha4/beta2/alpha5
Type:
Mol. Mass.:
69963.49
Organism:
Homo sapiens (Human)
Description:
NACHRA4
Residue:
627
  
Component 2
Name:
Neuronal acetylcholine receptor subunit beta-2
Synonyms:
ACHB2_HUMAN Neuronal acetylcholine receptor protein beta-2 subunit | Nicotinic acetylcholine receptor alpha3/beta2/alpha5
Type:
Protein
Mol. Mass.:
57020.50
Organism:
Homo sapiens (Human)
Description:
P17787
Residue:
502
  
Inhibitor
Name:
BDBM50442930
Synonyms:
CHEMBL3086991
Type:
Small organic molecule
Emp. Form.:
C17H16N2O
Mol. Mass.:
264.3217
SMILES:
C(Oc1cncc(c1)C#Cc1ccccc1)[C@@H]1CCN1
: