Target
Fatty-acid amide hydrolase 1
Ligand
BDBM50442959
Substrate
Meas. Tech.
ChEMBL_1276450 (CHEMBL3088546)
IC50
23±n/a nM
Citation
 Patel, JZParkkari, TLaitinen, TKaczor, AASaario, SMSavinainen, JRNavia-Paldanius, DCipriano, MLeppänen, JKoshevoy, IOPoso, AFowler, CJLaitinen, JTNevalainen, T Chiral 1,3,4-oxadiazol-2-ones as highly selective FAAH inhibitors. J Med Chem 56:8484-96 (2013)  
Target
Name:
Fatty-acid amide hydrolase 1
Synonyms:
Anandamide amidohydrolase FAAH FAAH1_HUMAN Fatty-acid amide hydrolase (FAAH) Oleamide hydrolase 1
Type:
Protein
Mol. Mass.:
63071.19
Organism:
Homo sapiens (Human)
Description:
O00519
Residue:
579
  
Inhibitor
Name:
BDBM50442959
Synonyms:
CHEMBL3087182
Type:
Small organic molecule
Emp. Form.:
C15H20N2O3
Mol. Mass.:
276.3309
SMILES:
COc1nn(C(C)c2ccc(CC(C)C)cc2)c(=O)o1
: