Target
KiSS-1 receptor
Ligand
BDBM50442974
Substrate
Meas. Tech.
ChEMBL_1276485 (CHEMBL3088609)
Ki
0.240000±n/a nM
Citation
 Asami, TNishizawa, NMatsui, HNishibori, KIshibashi, YHorikoshi, YNakayama, MMatsumoto, STarui, NYamaguchi, MMatsumoto, HOhtaki, TKitada, C Design, synthesis, and biological evaluation of novel investigational nonapeptide KISS1R agonists with testosterone-suppressive activity. J Med Chem 56:8298-307 (2013)  
Target
Name:
KiSS-1 receptor
Synonyms:
Gpr54 Kiss1r
Type:
PROTEIN
Mol. Mass.:
42915.37
Organism:
Rattus norvegicus
Description:
ChEMBL_1448383
Residue:
396
  
Inhibitor
Name:
BDBM50442974
Synonyms:
CHEMBL3085811
Type:
Small organic molecule
Emp. Form.:
C52H75N15O13
Mol. Mass.:
1118.2446
SMILES:
CNC(N)=NCCC[C@H](NC(=O)[C@H](CC(C)C)NC(=O)NNC(=O)[C@H](Cc1ccccc1)NC(=O)[C@H](CO)NC(=O)[C@H](CC(N)=O)NC(=O)[C@@H](NC(=O)[C@H](N)Cc1ccc(O)cc1)[C@@H](C)O)C(=O)N[C@@H](Cc1ccccc1)C(N)=O
: