Target
Indoleamine 2,3-dioxygenase 1
Ligand
BDBM50442987
Substrate
Meas. Tech.
ChEMBL_1276664 (CHEMBL3089096)
Ki
389±n/a nM
Citation
 Yang, SLi, XHu, FLi, YYang, YYan, JKuang, CYang, Q Discovery of tryptanthrin derivatives as potent inhibitors of indoleamine 2,3-dioxygenase with therapeutic activity in Lewis lung cancer (LLC) tumor-bearing mice. J Med Chem 56:8321-31 (2013)  
Target
Name:
Indoleamine 2,3-dioxygenase 1
Synonyms:
I23O1_HUMAN IDO-1 INDO Indoleamine 2,3-dioxygenase | Indoleamine-pyrrole 2,3-dioxygenase
Type:
Enzyme
Mol. Mass.:
45330.80
Organism:
Homo sapiens (Human)
Description:
P14902
Residue:
403
  
Inhibitor
Name:
BDBM50442987
Synonyms:
8-Bromotryptanthrin | CHEMBL72165
Type:
Small organic molecule
Emp. Form.:
C15H7BrN2O2
Mol. Mass.:
327.132
SMILES:
Brc1ccc-2c(c1)C(=O)c1nc3ccccc3c(=O)n-21
: