Target
Uridine phosphorylase 1
Ligand
BDBM50443010
Substrate
Meas. Tech.
ChEMBL_1275624 (CHEMBL3090755)
Kd
40±n/a nM
Citation
 Renck, DMachado, PSouto, AARosado, LAErig, TCampos, MMFarias, CBRoesler, RTimmers, LFde Souza, ONSantos, DSBasso, LA Design of novel potent inhibitors of human uridine phosphorylase-1: synthesis, inhibition studies, thermodynamics, and in vitro influence on 5-fluorouracil cytotoxicity. J Med Chem 56:8892-902 (2013)  
Target
Name:
Uridine phosphorylase 1
Synonyms:
UP UPP1_HUMAN UrdPase 1 | Uridine phosphorylase (UPase)
Type:
Enzyme
Mol. Mass.:
33939.54
Organism:
Homo sapiens (Human)
Description:
Q16831
Residue:
310
  
Inhibitor
Name:
BDBM50443010
Synonyms:
CHEMBL3086510
Type:
Small organic molecule
Emp. Form.:
C7H6N2O2
Mol. Mass.:
150.1347
SMILES:
Cc1cc(O)[nH]c(=O)c1C#N
: