Target
Histone-lysine N-methyltransferase, H3 lysine-79 specific
Ligand
BDBM50396996
Substrate
Meas. Tech.
ChEMBL_1275652 (CHEMBL3090823)
Ki
550±n/a nM
Citation
 Anglin, JLSong, Y A medicinal chemistry perspective for targeting histone H3 lysine-79 methyltransferase DOT1L. J Med Chem 56:8972-83 (2013)  
Target
Name:
Histone-lysine N-methyltransferase, H3 lysine-79 specific
Synonyms:
2.1.1.43 DOT1-like protein (Dot1L) DOT1L_HUMAN Histone H3-K79 methyltransferase Histone Methyltransferase DOT1L KIAA1814 Lysine N-methyltransferase 4
Type:
Protein
Mol. Mass.:
184911.91
Organism:
Homo sapiens (Human)
Description:
Q8TEK3
Residue:
1537
  
Inhibitor
Name:
BDBM50396996
Synonyms:
CHEMBL2170989
Type:
Small organic molecule
Emp. Form.:
C20H25N7O4S
Mol. Mass.:
459.522
SMILES:
Nc1ncnc2n(cnc12)[C@@H]1O[C@H](CSCCCNC(=O)Nc2ccccc2)[C@@H](O)[C@H]1O
: