Target
Metabotropic glutamate receptor 5
Ligand
BDBM50443081
Substrate
Meas. Tech.
ChEMBL_1276187 (CHEMBL3089425)
IC50
86±n/a nM
Citation
 Kubas, HMeyer, UHechenberger, MKlein, KUPlitt, PZemribo, RSpexgoor, HWvan Assema, SGAbel, U Scaffold hopping approach towards various AFQ-056 analogs as potent metabotropic glutamate receptor 5 negative allosteric modulators. Bioorg Med Chem Lett 23:6370-6 (2013)  
Target
Name:
Metabotropic glutamate receptor 5
Synonyms:
GPRC1E GRM5_HUMAN metabotropic glutamate 5 | metabotropic glutamate 5a
Type:
Enzyme
Mol. Mass.:
132484.72
Organism:
Homo sapiens (Human)
Description:
Residue:
1212
  
Inhibitor
Name:
BDBM50443081
Synonyms:
CHEMBL3087212
Type:
Small organic molecule
Emp. Form.:
C21H27NO3
Mol. Mass.:
341.444
SMILES:
COC(=O)N1CCCCC11CCCC(O)(C1)C#Cc1cccc(C)c1
: