Target
Potassium voltage-gated channel subfamily H member 2
Ligand
BDBM50443217
Substrate
Meas. Tech.
ChEMBL_1276747 (CHEMBL3089255)
IC50
44000±n/a nM
Citation
 Gao, ZHurst, WJCzechtizky, WHall, DMoindrot, NNagorny, RPichat, PStefany, DHendrix, JAGeorge, PG Identification and profiling of 3,5-dimethyl-isoxazole-4-carboxylic acid [2-methyl-4-((2S,3'S)-2-methyl-[1,3']bipyrrolidinyl-1'-yl)phenyl] amide as histamine H(3) receptor antagonist for the treatment of depression. Bioorg Med Chem Lett 23:6269-73 (2013)  
Target
Name:
Potassium voltage-gated channel subfamily H member 2
Synonyms:
CERG ERG Eag-related protein 1 Ether-a-go-go-related protein 1 KCNH2_CANLF c-ERG
Type:
PROTEIN
Mol. Mass.:
126660.03
Organism:
Canis familiaris
Description:
ChEMBL_107964
Residue:
1158
  
Inhibitor
Name:
BDBM50443217
Synonyms:
CHEMBL3087669
Type:
Small organic molecule
Emp. Form.:
C22H30N4O2
Mol. Mass.:
382.4992
SMILES:
C[C@H]1CCCN1[C@H]1CCN(C1)c1ccc(NC(=O)c2c(C)noc2C)c(C)c1
: