Target
Bromodomain-containing protein 4
Ligand
BDBM50443230
Substrate
Meas. Tech.
ChEMBL_1277422 (CHEMBL3089612)
IC50
3400±n/a nM
Citation
 Zhang, GPlotnikov, ANRusinova, EShen, TMorohashi, KJoshua, JZeng, LMujtaba, SOhlmeyer, MZhou, MM Structure-guided design of potent diazobenzene inhibitors for the BET bromodomains. J Med Chem 56:9251-64 (2013)  
Target
Name:
Bromodomain-containing protein 4
Synonyms:
BRD4_MOUSE Mcap | Mitotic chromosome-associated protein
Type:
PROTEIN
Mol. Mass.:
155942.13
Organism:
Mus musculus
Description:
ChEMBL_107967
Residue:
1400
  
Inhibitor
Name:
BDBM50443230
Synonyms:
CHEMBL3086885
Type:
Small organic molecule
Emp. Form.:
C18H16ClN5O3S
Mol. Mass.:
417.869
SMILES:
Cc1cc(N=Nc2ccc(cc2)S(=O)(=O)Nc2ccccn2)c(N)c(Cl)c1O
: