Target
Bromodomain-containing protein 3
Ligand
BDBM50443231
Substrate
Meas. Tech.
ChEMBL_1277434 (CHEMBL3089624)
Ki
220±n/a nM
Citation
 Zhang, GPlotnikov, ANRusinova, EShen, TMorohashi, KJoshua, JZeng, LMujtaba, SOhlmeyer, MZhou, MM Structure-guided design of potent diazobenzene inhibitors for the BET bromodomains. J Med Chem 56:9251-64 (2013)  
Target
Name:
Bromodomain-containing protein 3
Synonyms:
BRD3 Bromodomain and extra-terminal motif (BET) Bromodomain-containing protein 3 (BRD3) RING3-like protein | RING3L
Type:
Protein
Mol. Mass.:
79571.81
Organism:
Homo sapiens (Human)
Description:
Q15059
Residue:
726
  
Inhibitor
Name:
BDBM50443231
Synonyms:
CHEMBL3086884
Type:
Small organic molecule
Emp. Form.:
C19H19N5O3S
Mol. Mass.:
397.451
SMILES:
Cc1cc(N=Nc2ccc(cc2)S(=O)(=O)Nc2ccccn2)c(N)c(C)c1O
: