Target
Bromodomain-containing protein 4
Ligand
BDBM50443238
Substrate
Meas. Tech.
ChEMBL_1277432 (CHEMBL3089622)
Ki
1280±n/a nM
Citation
 Zhang, GPlotnikov, ANRusinova, EShen, TMorohashi, KJoshua, JZeng, LMujtaba, SOhlmeyer, MZhou, MM Structure-guided design of potent diazobenzene inhibitors for the BET bromodomains. J Med Chem 56:9251-64 (2013)  
Target
Name:
Bromodomain-containing protein 4
Synonyms:
BRD4 Bromodomain-containing protein 4 (BRD4) Protein HUNK1
Type:
Protein
Mol. Mass.:
152264.84
Organism:
Homo sapiens (Human)
Description:
O60885
Residue:
1362
  
Inhibitor
Name:
BDBM50443238
Synonyms:
CHEMBL3086886
Type:
Small organic molecule
Emp. Form.:
C18H17N5O4S
Mol. Mass.:
399.424
SMILES:
COc1cc(N=Nc2ccc(cc2)S(=O)(=O)Nc2ccccn2)c(N)cc1O
: