Target
Bromodomain-containing protein 4
Ligand
BDBM50443242
Substrate
Meas. Tech.
ChEMBL_1277432 (CHEMBL3089622)
Ki
1300±n/a nM
Citation
 Zhang, GPlotnikov, ANRusinova, EShen, TMorohashi, KJoshua, JZeng, LMujtaba, SOhlmeyer, MZhou, MM Structure-guided design of potent diazobenzene inhibitors for the BET bromodomains. J Med Chem 56:9251-64 (2013)  
Target
Name:
Bromodomain-containing protein 4
Synonyms:
BRD4 Bromodomain-containing protein 4 (BRD4) Protein HUNK1
Type:
Protein
Mol. Mass.:
152264.84
Organism:
Homo sapiens (Human)
Description:
O60885
Residue:
1362
  
Inhibitor
Name:
BDBM50443242
Synonyms:
CHEMBL3086879
Type:
Small organic molecule
Emp. Form.:
C17H13ClN4O3S
Mol. Mass.:
388.828
SMILES:
Oc1ccc(cc1Cl)N=Nc1ccc(cc1)S(=O)(=O)Nc1ccccn1
: