Target
Bromodomain-containing protein 4
Ligand
BDBM50443247
Substrate
Meas. Tech.
ChEMBL_1277432 (CHEMBL3089622)
Ki
3130±n/a nM
Citation
 Zhang, GPlotnikov, ANRusinova, EShen, TMorohashi, KJoshua, JZeng, LMujtaba, SOhlmeyer, MZhou, MM Structure-guided design of potent diazobenzene inhibitors for the BET bromodomains. J Med Chem 56:9251-64 (2013)  
Target
Name:
Bromodomain-containing protein 4
Synonyms:
BRD4 Bromodomain-containing protein 4 (BRD4) Protein HUNK1
Type:
Protein
Mol. Mass.:
152264.84
Organism:
Homo sapiens (Human)
Description:
O60885
Residue:
1362
  
Inhibitor
Name:
BDBM50443247
Synonyms:
CHEMBL3087046
Type:
Small organic molecule
Emp. Form.:
C20H20N4O4S
Mol. Mass.:
412.462
SMILES:
COc1cc(ccc1S(=O)(=O)Nc1ccccn1)N=Nc1cc(C)c(O)c(C)c1
: