Target
Lysosomal Pro-X carboxypeptidase
Ligand
BDBM50443351
Substrate
Meas. Tech.
ChEMBL_1275525 (CHEMBL3090540)
IC50
0.180000±n/a nM
Citation
 Debenham, JSGraham, THVerras, AZhang, YClements, MJKuethe, JTMadsen-Duggan, CLiu, WBhatt, URChen, DChen, QGarcia-Calvo, MGeissler, WMHe, HLi, XLisnock, JShen, ZTong, XTung, ECWiltsie, JXu, SHale, JJPinto, SShen, DM Discovery and optimization of orally active cyclohexane-based prolylcarboxypeptidase (PrCP) inhibitors. Bioorg Med Chem Lett 23:6228-33 (2013)  
Target
Name:
Lysosomal Pro-X carboxypeptidase
Synonyms:
Angiotensinase C PCP PRCP Prolylcarboxypeptidase | Prolylcarboxypeptidase (PRCP)
Type:
Enzyme
Mol. Mass.:
55805.19
Organism:
Homo sapiens (Human)
Description:
P42785
Residue:
496
  
Inhibitor
Name:
BDBM50443351
Synonyms:
CHEMBL3086037 | US8669252, 15
Type:
Small organic molecule
Emp. Form.:
C29H31BrClN3O2
Mol. Mass.:
568.932
SMILES:
Clc1ccc(cc1)C(NC(=O)[C@@H]1CC[C@H](C[C@H]1c1ccc(Br)cc1)N1CCOCC1)c1ccncc1
: