Target
Aurora kinase A
Ligand
BDBM50443501
Substrate
Meas. Tech.
ChEMBL_1275024 (CHEMBL3090782)
IC50
71±n/a nM
Citation
 Bavetsias, VFaisal, ACrumpler, SBrown, NKosmopoulou, MJoshi, AAtrash, BPérez-Fuertes, YSchmitt, JABoxall, KJBurke, RSun, CAvery, SBush, KHenley, ARaynaud, FIWorkman, PBayliss, RLinardopoulos, SBlagg, J Aurora isoform selectivity: design and synthesis of imidazo[4,5-b]pyridine derivatives as highly selective inhibitors of Aurora-A kinase in cells. J Med Chem 56:9122-35 (2013)  
Target
Name:
Aurora kinase A
Synonyms:
AIK ARK1 AURKA AYK1 Aurora kinase A (AURA) Aurora kinase A (Aurora A) Aurora-related kinase 1 BTAK Breast-tumor-amplified kinase STK15 Serine/threonine kinase 15 Serine/threonine-protein kinase aurora A hARK1
Type:
Serine/threonine-protein kinase
Mol. Mass.:
45830.98
Organism:
Homo sapiens (Human)
Description:
O14965
Residue:
403
  
Inhibitor
Name:
BDBM50443501
Synonyms:
CHEMBL3085798
Type:
Small organic molecule
Emp. Form.:
C22H18ClN7O3
Mol. Mass.:
463.876
SMILES:
Cc1cc(NC(=O)c2ccc(Oc3c(Cl)cnc4nc([nH]c34)-c3cn(C)nc3C)cc2)on1
: