Target
Tyrosine-protein phosphatase non-receptor type 1
Ligand
BDBM50443537
Substrate
Meas. Tech.
ChEMBL_1275583 (CHEMBL3090684)
IC50
>30000±n/a nM
Citation
 Nguyen, PHYang, JLUddin, MNPark, SLLim, SIJung, DWWilliams, DROh, WK Protein tyrosine phosphatase 1B (PTP1B) inhibitors from Morinda citrifolia (Noni) and their insulin mimetic activity. J Nat Prod 76:2080-7 (2013)  
Target
Name:
Tyrosine-protein phosphatase non-receptor type 1
Synonyms:
PTN1_HUMAN PTPN1 Protein tyrosine phosphatase-1B (PTP1B) Protein-tyrosine phosphatase 1B (PTP1B) Tyrosine-protein phosphatase non-receptor type 1 (PTP1B)
Type:
Protein phosphatase
Mol. Mass.:
49963.76
Organism:
Homo sapiens (Human)
Description:
Human recombinant GST-fusion PTP1B (1-435).
Residue:
435
  
Inhibitor
Name:
BDBM50443537
Synonyms:
CHEMBL3088129
Type:
Small organic molecule
Emp. Form.:
C19H18O7
Mol. Mass.:
358.342
SMILES:
COc1cc(ccc1O)[C@H]1Oc2ccc(\C=C\C(O)=O)cc2O[C@@H]1CO
: