Target
Tyrosine-protein phosphatase non-receptor type 1
Ligand
BDBM50443540
Substrate
Meas. Tech.
ChEMBL_1275583 (CHEMBL3090684)
IC50
21860±n/a nM
Citation
 Nguyen, PHYang, JLUddin, MNPark, SLLim, SIJung, DWWilliams, DROh, WK Protein tyrosine phosphatase 1B (PTP1B) inhibitors from Morinda citrifolia (Noni) and their insulin mimetic activity. J Nat Prod 76:2080-7 (2013)  
Target
Name:
Tyrosine-protein phosphatase non-receptor type 1
Synonyms:
PTN1_HUMAN PTPN1 Protein tyrosine phosphatase-1B (PTP1B) Protein-tyrosine phosphatase 1B (PTP1B) Tyrosine-protein phosphatase non-receptor type 1 (PTP1B)
Type:
Protein phosphatase
Mol. Mass.:
49963.76
Organism:
Homo sapiens (Human)
Description:
Human recombinant GST-fusion PTP1B (1-435).
Residue:
435
  
Inhibitor
Name:
BDBM50443540
Synonyms:
CHEMBL1688937
Type:
Small organic molecule
Emp. Form.:
C18H18O6
Mol. Mass.:
330.3319
SMILES:
Oc1ccc(cc1O)[C@H]1OC[C@H]2[C@@H]1CO[C@H]2c1ccc(O)c(O)c1
: