Target
C-X-C chemokine receptor type 4
Ligand
BDBM50035696
Substrate
Meas. Tech.
ChEMBL_1278923 (CHEMBL3097223)
IC50
30±n/a nM
Citation
 Truax, VMZhao, HKatzman, BMProsser, ARAlcaraz, AASaindane, MTHoward, RBCulver, DArrendale, RFGruddanti, PREvers, TJNatchus, MGSnyder, JPLiotta, DCWilson, LJ Discovery of tetrahydroisoquinoline-based CXCR4 antagonists. ACS Med Chem Lett 4:1025-30 (2013)  
Target
Name:
C-X-C chemokine receptor type 4
Synonyms:
C-X-C chemokine receptor type 4 CD_antigen=CD184 CXCR-4 CXCR4_HUMAN Fusin LCR1 Leukocyte-derived seven transmembrane domain receptor SDF-1 receptor | Stromal cell-derived factor 1 receptor
Type:
Enzyme
Mol. Mass.:
39754.61
Organism:
Homo sapiens (Human)
Description:
P61073
Residue:
352
  
Inhibitor
Name:
BDBM50035696
Synonyms:
1,1''-{1,4-phenylenebis(methylene)}-bis{1,4,8,11-tetraaza-cyclotetradecane} 1,4,8,11-tetraazacyclotetradecanyl[4-(1,4,8,11-tetraazacyclotetradecanylmethyl)phenyl]methane(8HBr.2H2O) 11''-xylyl bis-1,4,8,11-tetraazacyclotetradecane AMD-3100 CHEMBL2311089 PLERIXAFOR OCTAHYDROCHLORIDE | US9205085, MSX-162
Type:
Small organic molecule
Emp. Form.:
C28H54N8
Mol. Mass.:
502.782
SMILES:
C(N1CCCNCCNCCCNCC1)c1ccc(CN2CCCNCCNCCCNCC2)cc1
: