Target
Serine/threonine-protein kinase Sgk1
Ligand
BDBM50443634
Substrate
Meas. Tech.
ChEMBL_1279843 (CHEMBL3095702)
IC50
2.0±n/a nM
Citation
 Blass, B N-[4-(1H-Pyrazolo[3,4-B]pyrazin-6yl)-phenyl]-sulonamides and Their Use As Pharmaceuticals. ACS Med Chem Lett 4:1022-4 (2013)  
Target
Name:
Serine/threonine-protein kinase Sgk1
Synonyms:
SGK SGK1_HUMAN Serine/threonine-protein kinase Sgk1 (SGK) Serum/glucocorticoid-regulated kinase 1 (SGK1)
Type:
Other Protein Type
Mol. Mass.:
48954.40
Organism:
Homo sapiens (Human)
Description:
Recombinant human SGK-1 enzyme produced in a baculovirus system.
Residue:
431
  
Inhibitor
Name:
BDBM50443634
Synonyms:
CHEMBL3092462 US9221828, 6
Type:
Small organic molecule
Emp. Form.:
C17H11ClF2N6O2S
Mol. Mass.:
436.823
SMILES:
Nc1n[nH]c2nc(cnc12)-c1ccc(NS(=O)(=O)c2cc(Cl)ccc2F)c(F)c1
: