Target
5-hydroxytryptamine receptor 4
Ligand
BDBM50443688
Substrate
Meas. Tech.
ChEMBL_1278685 (CHEMBL3095863)
Ki
9.0±n/a nM
Citation
 Fontenelle, CQWang, ZFossey, CCailly, TLinclau, BFabis, F Design of fluorinated 5-HT(4)R antagonists: influence of the basicity and lipophilicity toward the 5-HT(4)R binding affinities. Bioorg Med Chem 21:7529-38 (2013)  
Target
Name:
5-hydroxytryptamine receptor 4
Synonyms:
5-HT4 5HT4R_CAVPO Serotonin 4 (5-HT4) receptor
Type:
Enzyme Catalytic Domain
Mol. Mass.:
43735.29
Organism:
GUINEA PIG
Description:
5-HT4 HTR4 GUINEA PIG::O70528
Residue:
388
  
Inhibitor
Name:
BDBM50443688
Synonyms:
CHEMBL3093186
Type:
Small organic molecule
Emp. Form.:
C21H21F4N3O
Mol. Mass.:
407.4046
SMILES:
Fc1cccc2c1nc(OCC1CCN(CCC(F)(F)F)CC1)c1cccnc21
: