Target
Prolyl endopeptidase FAP
Ligand
BDBM50443761
Substrate
Meas. Tech.
ChEMBL_1279907 (CHEMBL3096167)
IC50
82±n/a nM
Citation
 Wang, JFeng, YJi, XDeng, GLeng, YLiu, H Synthesis and biological evaluation of pyrrolidine-2-carbonitrile and 4-fluoropyrrolidine-2-carbonitrile derivatives as dipeptidyl peptidase-4 inhibitors for the treatment of type 2 diabetes. Bioorg Med Chem 21:7418-29 (2013)  
Target
Name:
Prolyl endopeptidase FAP
Synonyms:
170 kDa melanoma membrane-bound gelatinase Fibroblast Activation Protein (FAP) Integral membrane serine protease Seprase
Type:
Enzyme
Mol. Mass.:
87712.48
Organism:
Homo sapiens (Human)
Description:
Q12884
Residue:
760
  
Inhibitor
Name:
BDBM50443761
Synonyms:
CHEMBL3093903
Type:
Small organic molecule
Emp. Form.:
C14H15F2N3O
Mol. Mass.:
279.2852
SMILES:
N[C@@H](Cc1ccc(F)cc1)C(=O)N1C[C@@H](F)C[C@H]1C#N
: