Target
Sonic hedgehog protein
Ligand
BDBM50443889
Substrate
Meas. Tech.
ChEMBL_1277855 (CHEMBL3097789)
IC50
0.800000±n/a nM
Citation
 Xin, MWen, JTang, FTu, CShen, HZhao, X The discovery of novel N-(2-pyrimidinylamino) benzamide derivatives as potent hedgehog signaling pathway inhibitors. Bioorg Med Chem Lett 23:6777-83 (2013)  
Target
Name:
Sonic hedgehog protein
Synonyms:
Hhg1 Shh
Type:
Protein
Mol. Mass.:
47784.50
Organism:
Mus musculus (Mouse)
Description:
Q62226
Residue:
437
  
Inhibitor
Name:
BDBM50443889
Synonyms:
CHEMBL3091552
Type:
Small organic molecule
Emp. Form.:
C29H27F3N4O2
Mol. Mass.:
520.5455
SMILES:
CCCc1cc(nc(Nc2ccc(cc2)C(=O)Nc2c(C)cccc2C)n1)-c1ccc(OC(F)(F)F)cc1
: