Target
Sonic hedgehog protein
Ligand
BDBM50443913
Substrate
Meas. Tech.
ChEMBL_1277855 (CHEMBL3097789)
IC50
1.3±n/a nM
Citation
 Xin, MWen, JTang, FTu, CShen, HZhao, X The discovery of novel N-(2-pyrimidinylamino) benzamide derivatives as potent hedgehog signaling pathway inhibitors. Bioorg Med Chem Lett 23:6777-83 (2013)  
Target
Name:
Sonic hedgehog protein
Synonyms:
Hhg1 Shh
Type:
Protein
Mol. Mass.:
47784.50
Organism:
Mus musculus (Mouse)
Description:
Q62226
Residue:
437
  
Inhibitor
Name:
BDBM50443913
Synonyms:
CHEMBL3091736
Type:
Small organic molecule
Emp. Form.:
C26H24N4O
Mol. Mass.:
408.495
SMILES:
Cc1cccc(C)c1NC(=O)c1ccc(Nc2ncc(C)c(n2)-c2ccccc2)cc1
: