Target
Protein mono-ADP-ribosyltransferase PARP3 [R100H]
Ligand
BDBM103555
Substrate
Meas. Tech.
ChEMBL_1278752 (CHEMBL3096299)
IC50
>100000±n/a nM
Citation
 Lindgren, AEKarlberg, TEkblad, TSpjut, SThorsell, AGAndersson, CDNhan, TTHellsten, VWeigelt, JLinusson, ASchüler, HElofsson, M Chemical probes to study ADP-ribosylation: synthesis and biochemical evaluation of inhibitors of the human ADP-ribosyltransferase ARTD3/PARP3. J Med Chem 56:9556-68 (2014)  
Target
Name:
Protein mono-ADP-ribosyltransferase PARP3 [R100H]
Synonyms:
(ARTD3 or PARP3) ADPRT3 Human diphtheria toxin-like ADP-ribosyltransferase (ARTD3 or PARP3) PARP3_HUMAN Poly [ADP-ribose] polymerase 3 (PARP-3) | Poly(ADP-ribose) polymerase-3 (ARTD3/PARP3)
Type:
PROTEIN
Mol. Mass.:
60071.85
Organism:
Homo sapiens (Human)
Description:
Q9Y6F1[R100H]
Residue:
533
  
Inhibitor
Name:
BDBM103555
Synonyms:
ME0354
Type:
Small organic molecule
Emp. Form.:
C18H18N4O2
Mol. Mass.:
322.3611
SMILES:
C[C@@H](NC(=O)CCc1nc2ccccc2c(=O)[nH]1)c1ccccn1
: