Target
D(2) dopamine receptor
Ligand
BDBM50444040
Substrate
Meas. Tech.
ChEMBL_1279266 (CHEMBL3095674)
Ki
1400±n/a nM
Citation
 Moritomo, AYamada, HWatanabe, TItahana, HAkuzawa, SOkada, MOhta, M Synthesis and structure-activity relationships of new carbonyl guanidine derivatives as novel dual 5-HT2B and 5-HT7 receptor antagonists. Bioorg Med Chem 21:7841-52 (2013)  
Target
Name:
D(2) dopamine receptor
Synonyms:
D(2) dopamine receptor DOPAMINE D2 Long DRD2 Dopamine D2 receptor Dopamine D2 receptor (D2R) Dopamine2-like | d2
Type:
Cell-surface receptors
Mol. Mass.:
50647.10
Organism:
Homo sapiens (Human)
Description:
P14416
Residue:
443
  
Inhibitor
Name:
BDBM50444040
Synonyms:
CHEMBL3092753
Type:
Small organic molecule
Emp. Form.:
C15H13N3O
Mol. Mass.:
251.2832
SMILES:
NC(=N)NC(=O)c1ccc-2c(Cc3ccccc-23)c1
: