Target
G protein-coupled receptor kinase 5
Ligand
BDBM50444105
Substrate
Meas. Tech.
ChEMBL_1280627 (CHEMBL3096888)
IC50
2830±n/a nM
Citation
 Cho, SYLee, BHJung, HYun, CSHa, JDKim, HRChae, CHLee, JHSeo, HWOh, KS Design and synthesis of novel 3-(benzo[d]oxazol-2-yl)-5-(1-(piperidin-4-yl)-1H-pyrazol-4-yl)pyridin-2-amine derivatives as selective G-protein-coupled receptor kinase-2 and -5 inhibitors. Bioorg Med Chem Lett 23:6711-6 (2013)  
Target
Name:
G protein-coupled receptor kinase 5
Synonyms:
G protein-coupled receptor kinase GRK5 GRK5 | GRK5_HUMAN
Type:
PROTEIN
Mol. Mass.:
67798.93
Organism:
Homo sapiens (Human)
Description:
ChEMBL_1280627
Residue:
590
  
Inhibitor
Name:
BDBM50444105
Synonyms:
CHEMBL3093246
Type:
Small organic molecule
Emp. Form.:
C28H24F3N7O2
Mol. Mass.:
547.5311
SMILES:
Nc1ncc(cc1-c1nc2ccc(NC(=O)c3ccc(cc3)C(F)(F)F)cc2o1)-c1cnn(c1)C1CCNCC1
: