Target
Beta-adrenergic receptor kinase 1
Ligand
BDBM50444095
Substrate
Meas. Tech.
ChEMBL_1280628 (CHEMBL3096889)
IC50
>10000±n/a nM
Citation
 Cho, SYLee, BHJung, HYun, CSHa, JDKim, HRChae, CHLee, JHSeo, HWOh, KS Design and synthesis of novel 3-(benzo[d]oxazol-2-yl)-5-(1-(piperidin-4-yl)-1H-pyrazol-4-yl)pyridin-2-amine derivatives as selective G-protein-coupled receptor kinase-2 and -5 inhibitors. Bioorg Med Chem Lett 23:6711-6 (2013)  
Target
Name:
Beta-adrenergic receptor kinase 1
Synonyms:
ADRBK1 BARK Beta-ARK-1 G-protein coupled receptor kinase 2 GRK2
Type:
Enzyme
Mol. Mass.:
79581.30
Organism:
Homo sapiens (Human)
Description:
P25098
Residue:
689
  
Inhibitor
Name:
BDBM50444095
Synonyms:
CHEMBL3093255
Type:
Small organic molecule
Emp. Form.:
C27H26N6O3
Mol. Mass.:
482.5337
SMILES:
COc1ccc(cc1)-c1c(O)ccc2nc(oc12)-c1cc(cnc1N)-c1cnn(c1)C1CCNCC1
: