Target
Tyrosine-protein kinase Mer
Ligand
BDBM50444245
Substrate
Meas. Tech.
ChEMBL_1277932 (CHEMBL3094776)
IC50
6.7±n/a nM
Citation
 Zhang, WMcIver, ALStashko, MADeRyckere, DBranchford, BRHunter, DKireev, DMiley, MJNorris-Drouin, JStewart, WMLee, MSather, SZhou, YDi Paola, JAMachius, MJanzen, WPEarp, HSGraham, DKFrye, SVWang, X Discovery of Mer specific tyrosine kinase inhibitors for the treatment and prevention of thrombosis. J Med Chem 56:9693-700 (2014)  
Target
Name:
Tyrosine-protein kinase Mer
Synonyms:
MER MERTK Proto-oncogene c-Mer Receptor tyrosine kinase MerTK | Tyrosine-protein kinase Mer
Type:
PROTEIN
Mol. Mass.:
110234.77
Organism:
Homo sapiens (Human)
Description:
ChEMBL_1498723
Residue:
999
  
Inhibitor
Name:
BDBM50444245
Synonyms:
CHEMBL3093752
Type:
Small organic molecule
Emp. Form.:
C26H38N6O3
Mol. Mass.:
482.6183
SMILES:
CCCCNc1ncc(C(=O)Nc2ccc(CN3CCOCC3)cc2)c(N[C@H]2CC[C@H](O)CC2)n1
: