Target
Cytochrome P450 2C19
Ligand
BDBM50444436
Substrate
Meas. Tech.
ChEMBL_1280216 (CHEMBL3094697)
IC50
>50000±n/a nM
Citation
 Zeng, QNair, AGRosenblum, SBHuang, HCLesburg, CAJiang, YSelyutin, OChan, TYBennett, FChen, KXVenkatraman, SSannigrahi, MVelazquez, FDuca, JSGavalas, SHuang, YPu, HWang, LPinto, PVibulbhan, BAgrawal, SFerrari, EJiang, CKLi, CHesk, DGesell, JSorota, SShih, NYNjoroge, FGKozlowski, JA Discovery of an irreversible HCV NS5B polymerase inhibitor. Bioorg Med Chem Lett 23:6585-7 (2013)  
Target
Name:
Cytochrome P450 2C19
Synonyms:
CP2CJ_HUMAN CYPIIC17 Cytochrome P450 2C19 (CYP2C19) Mephenytoin 4-hydroxylase P450-254C
Type:
Enzyme
Mol. Mass.:
55935.47
Organism:
Homo sapiens (Human)
Description:
P33261
Residue:
490
  
Inhibitor
Name:
BDBM50444436
Synonyms:
CHEMBL3092124
Type:
Small organic molecule
Emp. Form.:
C25H17ClFN3O3
Mol. Mass.:
461.872
SMILES:
Cc1cc2c(c(C(O)=O)n(Cc3cc4ccccc4nc3Cl)c2cc1F)-c1ccc[nH]c1=O
: