Target
Cytochrome P450 11B2, mitochondrial
Ligand
BDBM50444550
Substrate
Meas. Tech.
ChEMBL_1281886 (CHEMBL3101039)
IC50
1.000000±n/a nM
Citation
 Meredith, ELKsander, GMonovich, LGPapillon, JPLiu, QMiranda, KMorris, PRao, CBurgis, RCapparelli, MHu, QYSingh, ARigel, DFJeng, AYBeil, MFu, FHu, CWLaSala, D Discovery and in Vivo Evaluation of Potent Dual CYP11B2 (Aldosterone Synthase) and CYP11B1 Inhibitors. ACS Med Chem Lett 4:1203-7 (2013)  
Target
Name:
Cytochrome P450 11B2, mitochondrial
Synonyms:
Aldosterone synthase CYPXIB2 Cyp11b2 Cytochrome P450 11B2 P450-Aldo-1 | Steroid 11-beta-hydroxylase
Type:
PROTEIN
Mol. Mass.:
58260.64
Organism:
Rattus norvegicus
Description:
ChEMBL_224979
Residue:
510
  
Inhibitor
Name:
BDBM50444550
Synonyms:
CHEMBL3099704
Type:
Small organic molecule
Emp. Form.:
C21H18FN3
Mol. Mass.:
331.3861
SMILES:
Fc1ccc(cc1)-c1cc(ccc1[C@H]1CCCCc2cncn12)C#N
: