Target
Kallikrein-7
Ligand
BDBM50444598
Substrate
Meas. Tech.
ChEMBL_1282442 (CHEMBL3100743)
Ki
55000±n/a nM
Citation
 Tan, XBertonati, CQin, LFurio, LEl Amri, CHovnanian, AReboud-Ravaux, MVilloutreix, BO Identification by in silico and in vitro screenings of small organic molecules acting as reversible inhibitors of kallikreins. Eur J Med Chem 70:661-8 (2013)  
Target
Name:
Kallikrein-7
Synonyms:
KLK7 Kallikrein 7 PRSS6 Serine protease 6 hK7 kallikrein-7 isoform 1 preproprotein
Type:
PROTEIN
Mol. Mass.:
27535.05
Organism:
Homo sapiens (Human)
Description:
ChEMBL_1469257
Residue:
253
  
Inhibitor
Name:
BDBM50444598
Synonyms:
CHEMBL3099878
Type:
Small organic molecule
Emp. Form.:
C23H22N4O4
Mol. Mass.:
418.4452
SMILES:
COc1cc(\C=C(\C#N)c2nc3ccccc3[nH]2)ccc1OCC(=O)N1CCOCC1
: