Target
Kallikrein-5 [D153N]
Ligand
BDBM50444598
Substrate
Meas. Tech.
ChEMBL_1282456 (CHEMBL3100883)
IC50
125000±n/a nM
Citation
 Tan, XBertonati, CQin, LFurio, LEl Amri, CHovnanian, AReboud-Ravaux, MVilloutreix, BO Identification by in silico and in vitro screenings of small organic molecules acting as reversible inhibitors of kallikreins. Eur J Med Chem 70:661-8 (2013)  
Target
Name:
Kallikrein-5 [D153N]
Synonyms:
KLK-L2 KLK5_HUMAN Kallikrein-5 SCTE | Stratum corneum tryptic enzyme
Type:
PROTEIN
Mol. Mass.:
32031.75
Organism:
Homo sapiens (Human)
Description:
ChEMBL_1282456
Residue:
293
  
Inhibitor
Name:
BDBM50444598
Synonyms:
CHEMBL3099878
Type:
Small organic molecule
Emp. Form.:
C23H22N4O4
Mol. Mass.:
418.4452
SMILES:
COc1cc(\C=C(\C#N)c2nc3ccccc3[nH]2)ccc1OCC(=O)N1CCOCC1
: