Target
Cyclin-A2/Cyclin-dependent kinase 2
Ligand
BDBM50444667
Substrate
Meas. Tech.
ChEMBL_1281454 (CHEMBL3101810)
IC50
>100000±n/a nM
Citation
 Premnath, PNLiu, SPerkins, TAbbott, JAnderson, EMcInnes, C Fragment based discovery of arginine isosteres through REPLACE: towards non-ATP competitive CDK inhibitors. Bioorg Med Chem 22:616-22 (2013)  
Target
Name:
Cyclin-A2/Cyclin-dependent kinase 2
Synonyms:
CDK2-CyclinA CDK2/Cyclin A Cyclin A2/dependent kinase 2 Cyclin-Dependent Kinase 2 (CDK2A)
Type:
Protein Complex
Mol. Mass.:
Description:
Cdk2/Cyclin A kinase was purified from insect cells coinfected with Cyclin A/Cdk2 baculovirus.
Components:
This complex has 2 components.
Component 1
Name:
Cyclin-dependent kinase 2
Synonyms:
CDK2 CDK2_HUMAN Cell division protein kinase 2 Protein cereblon/Cyclin-dependent kinase 2 | p33 protein kinase
Type:
Enzyme Subunit
Mol. Mass.:
33938.17
Organism:
Homo sapiens (Human)
Description:
P24941
Residue:
298
  
Component 2
Name:
Cyclin-A2
Synonyms:
CCN1 CCNA1 CCNA2_HUMAN Cyclin-A
Type:
Enzyme Subunit
Mol. Mass.:
48550.19
Organism:
Homo sapiens (Human)
Description:
P20248
Residue:
432
  
Inhibitor
Name:
BDBM50444667
Synonyms:
CHEMBL3098664
Type:
Small organic molecule
Emp. Form.:
C36H51N9O7
Mol. Mass.:
721.8462
SMILES:
[#6]-[#6]-[#6@H](-[#6])-[#6@H](-[#7]-[#6](=O)-[#6@H](-[#6]-[#6](-[#6])-[#6])-[#7]-[#6](=O)-[#6@H](-[#6]-[#6]-[#6]\[#7]=[#6](/[#7])-[#7])-[#7]-[#6](=O)-c1ccc(-[#6]-n2ccnc2)o1)-[#6](=O)-[#7]-[#6@@H](-[#6]-c1ccccc1)-[#6](-[#8])=O
: