Target
DNA ligase
Ligand
BDBM50444687
Substrate
Meas. Tech.
ChEMBL_1281598 (CHEMBL3102283)
IC50
8900±n/a nM
Citation
 Murphy-Benenato, KWang, HMcGuire, HMDavis, HEGao, NPrince, DBJahic, HStokes, SSBoriack-Sjodin, PA Identification through structure-based methods of a bacterial NAD(+)-dependent DNA ligase inhibitor that avoids known resistance mutations. Bioorg Med Chem Lett 24:360-6 (2013)  
Target
Name:
DNA ligase
Synonyms:
DNLJ_STAAU lig | ligA
Type:
PROTEIN
Mol. Mass.:
75059.93
Organism:
Staphylococcus aureus
Description:
ChEMBL_1281598
Residue:
667
  
Inhibitor
Name:
BDBM50444687
Synonyms:
CHEMBL3098811
Type:
Small organic molecule
Emp. Form.:
C11H11N3O3S
Mol. Mass.:
265.288
SMILES:
CCOC(=O)c1cc2c(N)ncc(C(N)=O)c2s1
: