Target
Proline racemase
Ligand
BDBM50444847
Substrate
Meas. Tech.
ChEMBL_1282558 (CHEMBL3101225)
IC50
341000000±n/a nM
Citation
 Harty, MNagar, MAtkinson, LLegay, CMDerksen, DJBearne, SL Inhibition of serine and proline racemases by substrate-product analogues. Bioorg Med Chem Lett 24:390-3 (2013)  
Target
Name:
Proline racemase
Synonyms:
prdF
Type:
PROTEIN
Mol. Mass.:
32973.46
Organism:
Clostridium sticklandii
Description:
ChEMBL_107984
Residue:
299
  
Inhibitor
Name:
BDBM50444847
Synonyms:
CHEMBL3099360
Type:
Small organic molecule
Emp. Form.:
C7H11NO2
Mol. Mass.:
141.1677
SMILES:
[O-]C(=O)C12CCC(CC1)[NH2+]2
: