Target
Inorganic pyrophosphatase
Ligand
BDBM50444856
Substrate
Meas. Tech.
ChEMBL_1282725 (CHEMBL3101912)
IC50
101500±n/a nM
Citation
 Lv, WBanerjee, BMolland, KLSeleem, MNGhafoor, AHamed, MIWan, BFranzblau, SGMesecar, ADCushman, M Synthesis of 3-(3-aryl-pyrrolidin-1-yl)-5-aryl-1,2,4-triazines that have antibacterial activity and also inhibit inorganic pyrophosphatase. Bioorg Med Chem 22:406-18 (2013)  
Target
Name:
Inorganic pyrophosphatase
Synonyms:
IPYR_MYCTU Inorganic pyrophosphatase (MtPPiase) Pyrophosphate phospho-hydrolase | ppa
Type:
Protein
Mol. Mass.:
18318.35
Organism:
Mycobacterium tuberculosis
Description:
P9WI55
Residue:
162
  
Inhibitor
Name:
BDBM50444856
Synonyms:
CHEMBL3099424
Type:
Small organic molecule
Emp. Form.:
C19H17ClN4
Mol. Mass.:
336.818
SMILES:
Clc1cccc(c1)C1CCN(C1)c1nncc(n1)-c1ccccc1
: