Target
Cyclin-dependent kinase 2
Ligand
BDBM50444932
Substrate
Meas. Tech.
ChEMBL_1281340 (CHEMBL3101313)
Ki
<100±n/a nM
Citation
 Deng, YShipps, GWZhao, LSiddiqui, MAPopovici-Muller, JCurran, PJDuca, JSHruza, AWFischmann, TOMadison, VSZhang, RMcNemar, CWMayhood, TWSyto, RAnnis, AKirschmeier, PLees, EMParry, DAWindsor, WT Modulating the interaction between CDK2 and cyclin A with a quinoline-based inhibitor. Bioorg Med Chem Lett 24:199-203 (2013)  
Target
Name:
Cyclin-dependent kinase 2
Synonyms:
CDK2 CDK2_HUMAN Cell division protein kinase 2 Protein cereblon/Cyclin-dependent kinase 2 | p33 protein kinase
Type:
Enzyme Subunit
Mol. Mass.:
33938.17
Organism:
Homo sapiens (Human)
Description:
P24941
Residue:
298
  
Inhibitor
Name:
BDBM50444932
Synonyms:
CHEMBL3099764
Type:
Small organic molecule
Emp. Form.:
C27H30N2O6
Mol. Mass.:
478.5369
SMILES:
CCCCCCc1ccc2nc(cc(C(O)=O)c2c1)C(=O)N[C@@H](Cc1ccc(O)cc1)C(=O)OC
: