Target
Neurotensin receptor type 1
Ligand
BDBM50248035
Substrate
Meas. Tech.
ChEMBL_1281491 (CHEMBL3101949)
EC50
<156±n/a nM
Citation
 Hershberger, PMHedrick, MPPeddibhotla, SMangravita-Novo, AGosalia, PLi, YGray, WVicchiarelli, MSmith, LHChung, TDThomas, JBCaron, MGPinkerton, ABBarak, LSRoth, GP Imidazole-derived agonists for the neurotensin 1 receptor. Bioorg Med Chem Lett 24:262-7 (2013)  
Target
Name:
Neurotensin receptor type 1
Synonyms:
Dopamine receptor D2L/neurotensin receptor NTS1 NTRR Neurotensin receptor 1 | neurotensin receptor type 1
Type:
PROTEIN
Mol. Mass.:
46278.89
Organism:
Homo sapiens (Human)
Description:
ChEMBL_1453811
Residue:
418
  
Inhibitor
Name:
BDBM50248035
Synonyms:
(2S)-2-(1-(7-chloroquinolin-4-yl)-5-(2,6-dimethoxyphenyl)-1H-pyrazole-3-carboxamido)-4-methylpentanoic acid | CHEMBL508044
Type:
Small organic molecule
Emp. Form.:
C27H27ClN4O5
Mol. Mass.:
522.98
SMILES:
COc1cccc(OC)c1-c1cc(nn1-c1ccnc2cc(Cl)ccc12)C(=O)N[C@@H](CC(C)C)C(O)=O
: