Target
P2Y purinoceptor 12
Ligand
BDBM50445020
Substrate
Meas. Tech.
ChEMBL_1281874 (CHEMBL3101027)
IC50
650±n/a nM
Citation
 Tu, WFan, JZhang, HXu, GLiu, ZQu, JYang, FZhang, LLuan, TYuan, JGong, AFeng, JSun, PDong, Q Synthesis and biological evaluation of cyclopentyl-triazolol-pyrimidine (CPTP) based P2Y12 antagonists. Bioorg Med Chem Lett 24:141-6 (2013)  
Target
Name:
P2Y purinoceptor 12
Synonyms:
P2Y purinoceptor 12 P2ry12 Purinergic receptor P2Y12
Type:
PROTEIN
Mol. Mass.:
39068.50
Organism:
Rattus norvegicus
Description:
ChEMBL_1454020
Residue:
343
  
Inhibitor
Name:
BDBM50445020
Synonyms:
CHEMBL3098238
Type:
Small organic molecule
Emp. Form.:
C21H24F2N6O4S
Mol. Mass.:
494.515
SMILES:
CCCSc1nc(N[C@@H]2C[C@H]2c2ccc(F)c(F)c2)c2nnn([C@@H]3[C@@H](O)[C@H](O)[C@@H](O)[C@H]3O)c2n1
: