Target
3-oxoacyl-[acyl-carrier-protein] synthase 3
Ligand
BDBM50368267
Substrate
Meas. Tech.
ChEMBL_1281878 (CHEMBL3101031)
IC50
6300±n/a nM
Citation
 Zhang, FWen, QWang, SFShahla Karim, BYang, YSLiu, JJZhang, WMZhu, HL Design, synthesis and antibacterial activities of 5-(pyrazin-2-yl)-4H-1,2,4-triazole-3-thiol derivatives containing Schiff base formation as FabH inhibitory. Bioorg Med Chem Lett 24:90-5 (2013)  
Target
Name:
3-oxoacyl-[acyl-carrier-protein] synthase 3
Synonyms:
3-oxoacyl-[acyl-carrier-protein] synthase 3-oxoacyl-[acyl-carrier-protein] synthase III | Beta-ketoacyl-ACP synthase III (FabH)
Type:
Enzyme
Mol. Mass.:
33506.68
Organism:
Escherichia coli
Description:
C3TDZ2
Residue:
317
  
Inhibitor
Name:
BDBM50368267
Synonyms:
KANAMYCIN B Kantrex | Klebcil
Type:
Small organic molecule
Emp. Form.:
C18H37N5O10
Mol. Mass.:
483.5139
SMILES:
NC[C@H]1O[C@H](O[C@@H]2[C@@H](N)C[C@@H](N)[C@H](O[C@H]3O[C@H](CO)[C@@H](O)[C@H](N)[C@H]3O)[C@H]2O)[C@H](N)[C@@H](O)[C@@H]1O
: